BDBM50315412 5-(4-Phenylfurazan-3-yloxy)pentylidenebis(phosphonic)-acid::CHEMBL1090779
SMILES OP(O)(=O)C(CCCCOc1nonc1-c1ccccc1)P(O)(O)=O
InChI Key InChIKey=NPUHGRMCBDPTIW-UHFFFAOYSA-N
Data  1 IC50
  Tab Delimited (TSV)   2D SDfile   Computed 3D by Vconf -m prep SDfile
Find this compound or compounds like it in BindingDB:
Activity Spreadsheet -- Enzyme Inhibition Constant Data from BindingDB
Found 1 hit for monomerid = 50315412
TargetSqualene synthase(Rattus norvegicus)
Universit£
Curated by ChEMBL
LigandPNGBDBM50315412(5-(4-Phenylfurazan-3-yloxy)pentylidenebis(phosphon...)
Affinity DataIC50:  1.77E+4nM. Assay description: Inhibition of squalene synthase in rat liver microsomes assessed as conversion of [1-3H]FPP to [3H]squalene level after 60 mins by liquid scintillati...
In DepthDetails ArticlePubMed