BDBM50315724 1-{[(3S,4R)-1-tert-Butyl-4-(2,4-difluorophenyl)pyrrolidin-3-yl]-carbonyl}-4-phenylpiperidin-4-ol::CHEMBL1090487
SMILES CC(C)(C)N1C[C@H]([C@@H](C1)c1ccc(F)cc1F)C(=O)N1CCC(O)(CC1)c1ccccc1
InChI Key InChIKey=MHIILDKFLFPQES-FCHUYYIVSA-N
Data  1 EC50
  Tab Delimited (TSV)   2D SDfile   Computed 3D by Vconf -m prep SDfile
Find this compound or compounds like it in BindingDB:
Activity Spreadsheet -- Enzyme Inhibition Constant Data from BindingDB
Found 1 hit for monomerid = 50315724
TargetMelanocortin receptor 4(Homo sapiens (Human))
Pfizer
Curated by ChEMBL
LigandPNGBDBM50315724(1-{[(3S,4R)-1-tert-Butyl-4-(2,4-difluorophenyl)pyr...)
Affinity DataEC50:  1.12E+3nM. Assay description: Agonist activity at human recombinant MC4 receptor expressed in CHO cells by cAMP responsive beta lactamase reporter gene assay
In DepthDetails ArticlePubMed