BDBM50315734 3-[7-(1-benzylpiperidin-4-yl)-4-morpholin-4-yl-5H-pyrrolo[3,2-d]-pyrimidin-2-yl]phenol::CHEMBL1088831
SMILES Oc1cccc(c1)-c1nc(N2CCOCC2)c2[nH]cc(C3CCN(Cc4ccccc4)CC3)c2n1
InChI Key InChIKey=BEHPFPYVKVKMJC-UHFFFAOYSA-N
Data  2 IC50
  Tab Delimited (TSV)   2D SDfile   Computed 3D by Vconf -m prep SDfile
Find this compound or compounds like it in BindingDB:
Activity Spreadsheet -- Enzyme Inhibition Constant Data from BindingDB
Found 2 hits for monomerid = 50315734
TargetSerine/threonine-protein kinase mTOR(Homo sapiens (Human))
Wyeth Research
Curated by ChEMBL
LigandPNGBDBM50315734(3-[7-(1-benzylpiperidin-4-yl)-4-morpholin-4-yl-5H-...)
Affinity DataIC50:  2.00E+3nM. Assay description: Inhibition of mTOR by DELFIA
In DepthDetails ArticlePubMed
LigandPNGBDBM50315734(3-[7-(1-benzylpiperidin-4-yl)-4-morpholin-4-yl-5H-...)
Affinity DataIC50:  340nM. Assay description: Inhibition of human PI3Kalpha by fluorescence polarization format assay
In DepthDetails ArticlePubMed