BDBM50315915 5-(7-methyl-6-(3-(methylsulfonyl)phenyl)-4-morpholinothieno[3,2-d]pyrimidin-2-yl)pyrimidin-2-amine::CHEMBL1091977
SMILES Cc1c(sc2c(nc(nc12)-c1cnc(N)nc1)N1CCOCC1)-c1cccc(c1)S(C)(=O)=O
InChI Key InChIKey=ONCWMCNSCPKGPD-UHFFFAOYSA-N
Data  1 KI
  Tab Delimited (TSV)   2D SDfile   Computed 3D by Vconf -m prep SDfile
Find this compound or compounds like it in BindingDB:
Activity Spreadsheet -- Enzyme Inhibition Constant Data from BindingDB
Found 1 hit for monomerid = 50315915
TargetSerine/threonine-protein kinase mTOR(Homo sapiens (Human))
Genentech
Curated by ChEMBL
LigandPNGBDBM50315915(5-(7-methyl-6-(3-(methylsulfonyl)phenyl)-4-morphol...)
Affinity DataKi:  4nM. Assay description: Inhibition of human recombinant mTOR assessed as reduction in GFP-4EBP1 phosphorylation after 30 mins by FRET assay
In DepthDetails ArticlePubMed