BDBM50316003 9-Amino-3-p-tolyl-3,4-dihydro-thieno[2,3-d:4,5-d']dipyrimidin-7-ol::CHEMBL1093868
SMILES Cc1ccc(cc1)-n1cnc2c(sc3[nH]c(=O)nc(N)c23)c1=O
InChI Key InChIKey=ORHYLNXULCSECE-UHFFFAOYSA-N
Data  2 IC50
  Tab Delimited (TSV)   2D SDfile   Computed 3D by Vconf -m prep SDfile
Find this compound or compounds like it in BindingDB:
Activity Spreadsheet -- Enzyme Inhibition Constant Data from BindingDB
Found 2 hits for monomerid = 50316003
TargetMetabotropic glutamate receptor 5(Homo sapiens (Human))
Merck Research Laboratories
Curated by ChEMBL
LigandPNGBDBM50316003(9-Amino-3-p-tolyl-3,4-dihydro-thieno[2,3-d:4,5-d']...)
Affinity DataIC50: >3.00E+3nM. Assay description: Antagonist activity at human mGluR5
In DepthDetails ArticlePubMed
TargetMetabotropic glutamate receptor 1(Homo sapiens (Human))
Merck Research Laboratories
Curated by ChEMBL
LigandPNGBDBM50316003(9-Amino-3-p-tolyl-3,4-dihydro-thieno[2,3-d:4,5-d']...)
Affinity DataIC50: >1.00E+3nM. Assay description: Antagonist activity at human mGluR1
In DepthDetails ArticlePubMed