BDBM50316004 9-Amino-7-mercapto-3-p-tolyl-3H-thieno[2,3-d:4,5-d']dipyrimidin-4-one::CHEMBL1093869
SMILES Cc1ccc(cc1)-n1cnc2c(sc3[nH]c(=S)nc(N)c23)c1=O
InChI Key InChIKey=LJGGUEQZSZKWTD-UHFFFAOYSA-N
Data  2 IC50
  Tab Delimited (TSV)   2D SDfile   Computed 3D by Vconf -m prep SDfile
Find this compound or compounds like it in BindingDB:
Activity Spreadsheet -- Enzyme Inhibition Constant Data from BindingDB
Found 2 hits for monomerid = 50316004
TargetMetabotropic glutamate receptor 5(Homo sapiens (Human))
Merck Research Laboratories
Curated by ChEMBL
LigandPNGBDBM50316004(9-Amino-7-mercapto-3-p-tolyl-3H-thieno[2,3-d:4,5-d...)
Affinity DataIC50: >3.00E+3nM. Assay description: Antagonist activity at human mGluR5
In DepthDetails ArticlePubMed
TargetMetabotropic glutamate receptor 1(Homo sapiens (Human))
Merck Research Laboratories
Curated by ChEMBL
LigandPNGBDBM50316004(9-Amino-7-mercapto-3-p-tolyl-3H-thieno[2,3-d:4,5-d...)
Affinity DataIC50:  3.10nM. Assay description: Antagonist activity at human mGluR1
In DepthDetails ArticlePubMed