BDBM50316010 9-Amino-7-cyclopropyl-3-p-tolyl-3H-thieno[2,3-d:4,5-d']dipyrimidin-4-one::CHEMBL1093987
SMILES Cc1ccc(cc1)-n1cnc2c(sc3nc(nc(N)c23)C2CC2)c1=O
InChI Key InChIKey=COVIJXPHVCANQM-UHFFFAOYSA-N
Data  2 IC50
  Tab Delimited (TSV)   2D SDfile   Computed 3D by Vconf -m prep SDfile
Find this compound or compounds like it in BindingDB:
Activity Spreadsheet -- Enzyme Inhibition Constant Data from BindingDB
Found 2 hits for monomerid = 50316010
TargetMetabotropic glutamate receptor 5(Homo sapiens (Human))
Merck Research Laboratories
Curated by ChEMBL
LigandPNGBDBM50316010(9-Amino-7-cyclopropyl-3-p-tolyl-3H-thieno[2,3-d:4,...)
Affinity DataIC50: >3.00E+3nM. Assay description: Antagonist activity at human mGluR5
In DepthDetails ArticlePubMed
TargetMetabotropic glutamate receptor 1(Homo sapiens (Human))
Merck Research Laboratories
Curated by ChEMBL
LigandPNGBDBM50316010(9-Amino-7-cyclopropyl-3-p-tolyl-3H-thieno[2,3-d:4,...)
Affinity DataIC50:  326nM. Assay description: Antagonist activity at human mGluR1
In DepthDetails ArticlePubMed