BDBM50316157 2,6-Diisopropylphenyl{[4-(3-Methoxyphenyl)-1-(5-propylpyrimidin-2-yl)piperidin-4-yl]carbonyl}sulfamate::CHEMBL1093026
SMILES CCCc1cnc(nc1)N1CCC(CC1)(C(=O)NS(=O)(=O)Oc1c(cccc1C(C)C)C(C)C)c1cccc(OC)c1
InChI Key InChIKey=IQWFXBLWVWKDMF-UHFFFAOYSA-N
Data  1 IC50
  Tab Delimited (TSV)   2D SDfile   Computed 3D by Vconf -m prep SDfile
Find this compound or compounds like it in BindingDB:
Activity Spreadsheet -- Enzyme Inhibition Constant Data from BindingDB
Found 1 hit for monomerid = 50316157
TargetSterol O-acyltransferase 1(Rattus norvegicus)
Dainippon Sumitomo Pharma
Curated by ChEMBL
LigandPNGBDBM50316157(2,6-Diisopropylphenyl{[4-(3-Methoxyphenyl)-1-(5-pr...)
Affinity DataIC50: >1.00E+3nM. Assay description: Inhibition of rat macrophages ACAT
In DepthDetails ArticlePubMed