BDBM50316778 CHEMBL1099339::tert-Butyl-2-{5-(4-hydroxyphenethoxy)-1-{5-[4-(methylthio)phenyl]pentyl}-1H-indole-3-yl}ethyl carbamate
SMILES CSc1ccc(CCCCCn2cc(CCNC(=O)OC(C)(C)C)c3cc(OCCc4ccc(O)cc4)ccc23)cc1
InChI Key InChIKey=YUDFSLOBZJIACN-UHFFFAOYSA-N
Data  4 IC50
  Tab Delimited (TSV)   2D SDfile   Computed 3D by Vconf -m prep SDfile
Find this compound or compounds like it in BindingDB:
Activity Spreadsheet -- Enzyme Inhibition Constant Data from BindingDB
Found 4 hits for monomerid = 50316778
TargetVascular endothelial growth factor receptor 3(Homo sapiens (Human))
Universit£T Leipzig
Curated by ChEMBL
LigandPNGBDBM50316778(CHEMBL1099339 | tert-Butyl-2-{5-(4-hydroxyphenetho...)
Affinity DataIC50: >5.00E+4nM. Assay description: Inhibition of VEGFR3 after 30 mins by chemiluminescence ELISA
In DepthDetails ArticlePubMed
TargetVascular endothelial growth factor receptor 2(Homo sapiens (Human))
Universit£T Leipzig
Curated by ChEMBL
LigandPNGBDBM50316778(CHEMBL1099339 | tert-Butyl-2-{5-(4-hydroxyphenetho...)
Affinity DataIC50: >5.00E+4nM. Assay description: Noncompetitive inhibition of VEGFR2 after 30 mins by chemiluminescence ELISA in presence of 25 uM ATP
In DepthDetails ArticlePubMed
TargetInsulin-like growth factor 1 receptor(Homo sapiens (Human))
Universit£T Leipzig
Curated by ChEMBL
LigandPNGBDBM50316778(CHEMBL1099339 | tert-Butyl-2-{5-(4-hydroxyphenetho...)
Affinity DataIC50: >5.00E+4nM. Assay description: Noncompetitive inhibition of IGF1R after 30 mins by chemiluminescence ELISA in presence of 50 uM ATP
In DepthDetails ArticlePubMed
TargetEpidermal growth factor receptor(Homo sapiens (Human))
Universit£T Leipzig
Curated by ChEMBL
LigandPNGBDBM50316778(CHEMBL1099339 | tert-Butyl-2-{5-(4-hydroxyphenetho...)
Affinity DataIC50: >5.00E+4nM. Assay description: Inhibition of EGFR after 30 mins by chemiluminescence ELISA
In DepthDetails ArticlePubMed