BDBM50316914 5-((4'-(2-(4-(2,2-dimethylbutyl)-1H-imidazol-2-yl)ethyl)biphenyl-2-yloxy)methyl)-1H-tetrazole::CHEMBL1094054
SMILES CCC(C)(C)Cc1cnc(CCc2ccc(cc2)-c2ccccc2OCc2nnn[nH]2)[nH]1
InChI Key InChIKey=BOVVZHBTPIUNQT-UHFFFAOYSA-N
Data  1 IC50  2 EC50
  Tab Delimited (TSV)   2D SDfile   Computed 3D by Vconf -m prep SDfile
Find this compound or compounds like it in BindingDB:
Activity Spreadsheet -- Enzyme Inhibition Constant Data from BindingDB
Found 3 hits for monomerid = 50316914
TargetBombesin receptor subtype-3(Mus musculus)
Amri
Curated by ChEMBL
LigandPNGBDBM50316914(5-((4'-(2-(4-(2,2-dimethylbutyl)-1H-imidazol-2-yl)...)
Affinity DataEC50:  2.90nM. Assay description: Agonist activity at mouse BRS3
In DepthDetails ArticlePubMed
TargetBombesin receptor subtype-3(Homo sapiens (Human))
Amri
Curated by ChEMBL
LigandPNGBDBM50316914(5-((4'-(2-(4-(2,2-dimethylbutyl)-1H-imidazol-2-yl)...)
Affinity DataEC50:  30nM. Assay description: Agonist activity at human BRS3
In DepthDetails ArticlePubMed
TargetBombesin receptor subtype-3(Homo sapiens (Human))
Amri
Curated by ChEMBL
LigandPNGBDBM50316914(5-((4'-(2-(4-(2,2-dimethylbutyl)-1H-imidazol-2-yl)...)
Affinity DataIC50:  5.30nM. Assay description: Binding affinity to human BRS3
In DepthDetails ArticlePubMed