BDBM50317003 2-amino-8-((morpholinoamino)methyl)-4-phenyl-5H-indeno[1,2-d]pyrimidin-5-one::CHEMBL1088247
SMILES Nc1nc2-c3cc(CNN4CCOCC4)ccc3C(=O)c2c(n1)-c1ccccc1
InChI Key InChIKey=IRZRRGHYHQDDFL-UHFFFAOYSA-N
Data  2 KI
  Tab Delimited (TSV)   2D SDfile   Computed 3D by Vconf -m prep SDfile
Find this compound or compounds like it in BindingDB:
Activity Spreadsheet -- Enzyme Inhibition Constant Data from BindingDB
Found 2 hits for monomerid = 50317003
TargetAdenosine receptor A2a(Homo sapiens (Human))
Johnson & Johnson Pharmaceutical Research And Development
Curated by ChEMBL
LigandPNGBDBM50317003(2-amino-8-((morpholinoamino)methyl)-4-phenyl-5H-in...)
Affinity DataKi:  1nM. Assay description: Antagonist activity at adenosine A2A receptor
In DepthDetails ArticlePubMed
TargetAdenosine receptor A1(Homo sapiens (Human))
Johnson & Johnson Pharmaceutical Research And Development
Curated by ChEMBL
LigandPNGBDBM50317003(2-amino-8-((morpholinoamino)methyl)-4-phenyl-5H-in...)
Affinity DataKi:  1.80nM. Assay description: Antagonist activity at adenosine A1 receptor
In DepthDetails ArticlePubMed