BDBM50317042 CHEMBL1097336::N1-((1S,2S)-3-(3,5-difluorophenyl)-1-((R)-4-(2,4-dimethylthiazol-5-ylsulfonyl)piperazin-2-yl)-1-hydroxypropan-2-yl)-5-methyl-N3,N3-dipropylisophthalamide
SMILES CCCN(CCC)C(=O)c1cc(C)cc(c1)C(=O)N[C@@H](Cc1cc(F)cc(F)c1)[C@H](O)[C@H]1CN(CCN1)S(=O)(=O)c1sc(C)nc1C
InChI Key InChIKey=GEJXKWCEBBEVFL-JBOQNHBVSA-N
Data  1 KI
  Tab Delimited (TSV)   2D SDfile   Computed 3D by Vconf -m prep SDfile
Find this compound or compounds like it in BindingDB:
Activity Spreadsheet -- Enzyme Inhibition Constant Data from BindingDB
Found 1 hit for monomerid = 50317042
TargetBeta-secretase 1(Homo sapiens (Human))
Merck Research Laboratories
Curated by ChEMBL
LigandPNGBDBM50317042(CHEMBL1097336 | N1-((1S,2S)-3-(3,5-difluorophenyl)...)
Affinity DataKi:  240nM. Assay description: Inhibition oh BACE1
In DepthDetails ArticlePubMed