BDBM50317239 (E)-4-(2,4-dichloro-5-methoxyphenylamino)-7-(4-morpholinobut-1-enyl)quinoline-3-carbonitrile::CHEMBL1088121
SMILES COc1cc(Nc2c(cnc3cc(\C=C\CCN4CCOCC4)ccc23)C#N)c(Cl)cc1Cl
InChI Key InChIKey=SVAFKXHQTWXBPF-DUXPYHPUSA-N
Data  2 IC50
  Tab Delimited (TSV)   2D SDfile   Computed 3D by Vconf -m prep SDfile
Find this compound or compounds like it in BindingDB:
Activity Spreadsheet -- Enzyme Inhibition Constant Data from BindingDB
Found 2 hits for monomerid = 50317239
TargetProto-oncogene tyrosine-protein kinase Src(Homo sapiens (Human))
Wyeth Research
Curated by ChEMBL
LigandPNGBDBM50317239((E)-4-(2,4-dichloro-5-methoxyphenylamino)-7-(4-mor...)
Affinity DataIC50:  1.10E+3nM. Assay description: Inhibition of Src-mediated cell proliferation in rat Rat-2 fibroblasts after 4 days by MTS assay
In DepthDetails ArticlePubMed
TargetProto-oncogene tyrosine-protein kinase Src(Homo sapiens (Human))
Wyeth Research
Curated by ChEMBL
LigandPNGBDBM50317239((E)-4-(2,4-dichloro-5-methoxyphenylamino)-7-(4-mor...)
Affinity DataIC50:  15nM. Assay description: Inhibition of human recombinant Src after 70 mins by FRET assay
In DepthDetails ArticlePubMed