BDBM50317319 4-(3-(3-(4-(trifluoromethyl)phenyl)ureido)benzamido)butanoic acid::CHEMBL1088687
SMILES OC(=O)CCCNC(=O)c1cccc(NC(=O)Nc2ccc(cc2)C(F)(F)F)c1
InChI Key InChIKey=NZJJBKRQNVPKCG-UHFFFAOYSA-N
Data  1 IC50
  Tab Delimited (TSV)   2D SDfile   Computed 3D by Vconf -m prep SDfile
Find this compound or compounds like it in BindingDB:
Activity Spreadsheet -- Enzyme Inhibition Constant Data from BindingDB
Found 1 hit for monomerid = 50317319
TargetBifunctional epoxide hydrolase 2(Homo sapiens (Human))
Ar£Te Therapeutics
Curated by ChEMBL
LigandPNGBDBM50317319(4-(3-(3-(4-(trifluoromethyl)phenyl)ureido)benzamid...)
Affinity DataIC50:  120nM. Assay description: Inhibition of soluble epoxide hydrolase by fluorescence assay
In DepthDetails ArticlePubMed