BDBM50317326 CHEMBL1086932::N-(3-fluoro-4-(2-(1-methyl-1H-imidazol-4-yl)thieno[3,2-b]pyridin-7-yloxy)phenyl)-5-methyl-1-phenyl-1H-pyrazole-4-carboxamide
SMILES Cc1c(cnn1-c1ccccc1)C(=O)Nc1ccc(Oc2ccnc3cc(sc23)-c2cn(C)cn2)c(F)c1
InChI Key InChIKey=LKHSVIZPSAOZJI-UHFFFAOYSA-N
Data  3 IC50
  Tab Delimited (TSV)   2D SDfile   Computed 3D by Vconf -m prep SDfile
Find this compound or compounds like it in BindingDB:
Activity Spreadsheet -- Enzyme Inhibition Constant Data from BindingDB
Found 3 hits for monomerid = 50317326
TargetMacrophage-stimulating protein receptor(Homo sapiens (Human))
Methylgene
Curated by ChEMBL
LigandPNGBDBM50317326(CHEMBL1086932 | N-(3-fluoro-4-(2-(1-methyl-1H-imid...)
Affinity DataIC50:  150nM. Assay description: Inhibition of TPR-tagged RON catalytic domain expressed in HEK293 cells
In DepthDetails ArticlePubMed
TargetVascular endothelial growth factor receptor 2(Homo sapiens (Human))
Methylgene
Curated by ChEMBL
LigandPNGBDBM50317326(CHEMBL1086932 | N-(3-fluoro-4-(2-(1-methyl-1H-imid...)
Affinity DataIC50:  2.00E+3nM. Assay description: Inhibition of VEGFR2
In DepthDetails ArticlePubMed
TargetHepatocyte growth factor receptor(Homo sapiens (Human))
Methylgene
Curated by ChEMBL
LigandPNGBDBM50317326(CHEMBL1086932 | N-(3-fluoro-4-(2-(1-methyl-1H-imid...)
Affinity DataIC50:  70nM. Assay description: Inhibition of c-Met
In DepthDetails ArticlePubMed