BDBM50317386 5-(Aminosulfonyl)-N-benzyl-2-(phenylthio)benzamide::CHEMBL1098496
SMILES NS(=O)(=O)c1ccc(Sc2ccccc2)c(c1)C(=O)NCc1ccccc1
InChI Key InChIKey=HTNHJMAIMHUHEK-UHFFFAOYSA-N
Data  2 IC50
  Tab Delimited (TSV)   2D SDfile   Computed 3D by Vconf -m prep SDfile
Find this compound or compounds like it in BindingDB:
Activity Spreadsheet -- Enzyme Inhibition Constant Data from BindingDB
Found 2 hits for monomerid = 50317386
TargetCarbonic anhydrase 4(Homo sapiens (Human))
Pfizer
Curated by ChEMBL
LigandPNGBDBM50317386(5-(Aminosulfonyl)-N-benzyl-2-(phenylthio)benzamide...)
Affinity DataIC50:  241nM. Assay description: Inhibition of carbonic anhydrase 4
In DepthDetails ArticlePubMed
TargetCarbonic anhydrase 2(Homo sapiens (Human))
Pfizer
Curated by ChEMBL
LigandPNGBDBM50317386(5-(Aminosulfonyl)-N-benzyl-2-(phenylthio)benzamide...)
Affinity DataIC50:  12.3nM. Assay description: Inhibition of carbonic anhydrase 2
In DepthDetails ArticlePubMed