BDBM50317818 3-ethyl 5-(4-nitrobenzyl)2,6-dimethyl-4-(3-nitrophenyl)-1,4-dihydropyridine-3,5-dicarboxylate::CHEMBL1095557
SMILES CCOC(=O)C1C(C(C(=O)OCc2ccc(cc2)[N+]([O-])=O)=C(C)N=C1C)c1cccc(c1)[N+]([O-])=O
InChI Key InChIKey=PQNGUBRSSYTJHP-UHFFFAOYSA-N
Data  2 IC50
  Tab Delimited (TSV)   2D SDfile   Computed 3D by Vconf -m prep SDfile
Find this compound or compounds like it in BindingDB:
Activity Spreadsheet -- Enzyme Inhibition Constant Data from BindingDB
Found 2 hits for monomerid = 50317818
TargetVoltage-dependent L-type calcium channel subunit alpha-1C(Oryctolagus cuniculus)
Northwestern University
Curated by ChEMBL
LigandPNGBDBM50317818(3-ethyl 5-(4-nitrobenzyl)2,6-dimethyl-4-(3-nitroph...)
Affinity DataIC50:  130nM. Assay description: Antagonist activity at rabbit Cav1.2 expressed in HEK293 cells assessed as inhibition of voltage pulse-induced calcium current by FLIPR calcium 4 ass...
In DepthDetails ArticlePubMed
TargetVoltage-dependent L-type calcium channel subunit alpha-1D(Rattus norvegicus)
Northwestern University
Curated by ChEMBL
LigandPNGBDBM50317818(3-ethyl 5-(4-nitrobenzyl)2,6-dimethyl-4-(3-nitroph...)
Affinity DataIC50:  140nM. Assay description: Antagonist activity at rat Cav1.3 expressed in HEK293 cells assessed as inhibition of voltage pulse-induced calcium current by FLIPR calcium 4 assay
In DepthDetails ArticlePubMed