BDBM50317851 5-(2-Methylquinolin-7-yl)-2-(pyridin-3-yl)benzonitrile::CHEMBL1099115
SMILES Cc1ccc2ccc(cc2n1)-c1ccc(-c2cccnc2)c(c1)C#N
InChI Key InChIKey=DISGEWVPWGIQEV-UHFFFAOYSA-N
Data  1 KI  1 IC50
  Tab Delimited (TSV)   2D SDfile   Computed 3D by Vconf -m prep SDfile
Find this compound or compounds like it in BindingDB:
Activity Spreadsheet -- Enzyme Inhibition Constant Data from BindingDB
Found 2 hits for monomerid = 50317851
TargetMetabotropic glutamate receptor 5(Rattus norvegicus (Rat))
National Institute On Drug Abuse-Intramural Research Program
Curated by ChEMBL
LigandPNGBDBM50317851(5-(2-Methylquinolin-7-yl)-2-(pyridin-3-yl)benzonit...)
Affinity DataKi:  730nM. Assay description: Displacement of [3HMPEP from rat cloned mGluR5 expressed in HEK293T cells by by scintillation counting
In DepthDetails ArticlePubMed
TargetMetabotropic glutamate receptor 5(Rattus norvegicus (Rat))
National Institute On Drug Abuse-Intramural Research Program
Curated by ChEMBL
LigandPNGBDBM50317851(5-(2-Methylquinolin-7-yl)-2-(pyridin-3-yl)benzonit...)
Affinity DataIC50:  1.34E+3nM. Assay description: Antagonist activity at rat mGluR5 expressed in HEK293A cells assessed as inhibition of glutamate-induced calcium flux preincubated for 140 secs befor...
In DepthDetails ArticlePubMed