BDBM50317938 (R)-3-(3-(1-(1-ethylpiperidin-3-yl)-4-methyl-2-phenyl-1H-imidazol-5-yl)phenyl)-N-hydroxyacrylamide::CHEMBL1099065
SMILES CCN1CCC[C@H](C1)n1c(nc(C)c1-c1cccc(\C=C\C(=O)NO)c1)-c1ccccc1
InChI Key InChIKey=UFXKUOBFPSDIAG-WOOPDLCSSA-N
Data  3 IC50
  Tab Delimited (TSV)   2D SDfile   Computed 3D by Vconf -m prep SDfile
Find this compound or compounds like it in BindingDB:
Activity Spreadsheet -- Enzyme Inhibition Constant Data from BindingDB
Found 3 hits for monomerid = 50317938
TargetHistone deacetylase 1(Homo sapiens (Human))
Takeda California
Curated by ChEMBL
LigandPNGBDBM50317938((R)-3-(3-(1-(1-ethylpiperidin-3-yl)-4-methyl-2-phe...)
Affinity DataIC50:  630nM. Assay description: Inhibition of human recombinant HDAC2
In DepthDetails ArticlePubMed
TargetHistone deacetylase 8(Homo sapiens (Human))
Takeda California
Curated by ChEMBL
LigandPNGBDBM50317938((R)-3-(3-(1-(1-ethylpiperidin-3-yl)-4-methyl-2-phe...)
Affinity DataIC50:  400nM. Assay description: Inhibition of human recombinant HDAC8
In DepthDetails ArticlePubMed
TargetHistone deacetylase 6(Homo sapiens (Human))
Takeda California
Curated by ChEMBL
LigandPNGBDBM50317938((R)-3-(3-(1-(1-ethylpiperidin-3-yl)-4-methyl-2-phe...)
Affinity DataIC50:  630nM. Assay description: Inhibition of human recombinant HDAC6
In DepthDetails ArticlePubMed