BDBM50318047 4-bromo-5-(2,4-difluorobenzyloxy)-2-(2,6-difluorophenyl)pyridazin-3(2H)-one::CHEMBL1099098
SMILES Fc1ccc(COc2cnn(-c3c(F)cccc3F)c(=O)c2Br)c(F)c1
InChI Key InChIKey=LYDIJOAIEYUAAS-UHFFFAOYSA-N
Data  2 IC50
  Tab Delimited (TSV)   2D SDfile   Computed 3D by Vconf -m prep SDfile
Find this compound or compounds like it in BindingDB:
Activity Spreadsheet -- Enzyme Inhibition Constant Data from BindingDB
Found 2 hits for monomerid = 50318047
TargetMitogen-activated protein kinase 14(Homo sapiens (Human))
Pfizer
Curated by ChEMBL
LigandPNGBDBM50318047(4-bromo-5-(2,4-difluorobenzyloxy)-2-(2,6-difluorop...)
Affinity DataIC50:  590nM. Assay description: Inhibition of p38alpha
In DepthDetails ArticlePubMed
TargetMitogen-activated protein kinase 9(Homo sapiens (Human))
Pfizer
Curated by ChEMBL
LigandPNGBDBM50318047(4-bromo-5-(2,4-difluorobenzyloxy)-2-(2,6-difluorop...)
Affinity DataIC50: >2.00E+5nM. Assay description: Inhibition of JNK2
In DepthDetails ArticlePubMed