BDBM50318103 (1R,2S)-2-[(1R)-1-Ethyl-2-(4-chlorobenzylamino)ethyl]-1-(1Himidazol-4-yl)cyclopropane::CHEMBL1094409
SMILES CC[C@@H](CNCc1ccc(Cl)cc1)[C@@H]1C[C@H]1c1cnc[nH]1
InChI Key InChIKey=NIEFTOQZOCLENX-CWRNSKLLSA-N
Data  1 KI
  Tab Delimited (TSV)   2D SDfile   Computed 3D by Vconf -m prep SDfile
Find this compound or compounds like it in BindingDB:
Activity Spreadsheet -- Enzyme Inhibition Constant Data from BindingDB
Found 1 hit for monomerid = 50318103
TargetHistamine H3 receptor(Homo sapiens (Human))
Hokkaido University
Curated by ChEMBL
LigandPNGBDBM50318103((1R,2S)-2-[(1R)-1-Ethyl-2-(4-chlorobenzylamino)eth...)
Affinity DataKi:  19.8nM. Assay description: Displacement of [3H]N-alpha-methyl-histamine from human histamine H3 receptor expressed in human HEK293-EBNA cells
In DepthDetails ArticlePubMed