BDBM50318194 (Z)-Ethyl-2-(3-((7-(2-methoxyphenyl)-9-oxo-5H-benzo[h]-thiazolo[2,3-b]quinazolin-10(6H,7H,9H)-ylidene)methyl)phenoxy)-acetate::CHEMBL1097427
SMILES CCOC(=O)COc1cccc(\C=c2/sc3=NC4=C(CCc5ccccc45)C(c4ccccc4OC)n3c2=O)c1
InChI Key InChIKey=KTYSKLXYVOPNRM-IMRQLAEWSA-N
Data  1 IC50
  Tab Delimited (TSV)   2D SDfile   Computed 3D by Vconf -m prep SDfile
Find this compound or compounds like it in BindingDB:
Activity Spreadsheet -- Enzyme Inhibition Constant Data from BindingDB
Found 1 hit for monomerid = 50318194
TargetBcl-2-like protein 1(Homo sapiens (Human))
Chinese Academy Of Sciences
Curated by ChEMBL
LigandPNGBDBM50318194((Z)-Ethyl-2-(3-((7-(2-methoxyphenyl)-9-oxo-5H-benz...)
Affinity DataIC50:  1.00E+5nM. Assay description: Inhibition of human Bcl-XL
In DepthDetails ArticlePubMed