BDBM50318199 (Z)-30-((7-(2-Methoxyphenyl)-9-oxo-5H-benzo[h]thiazolo[2,3-b]-quinazolin-10(6H,7H,9H)-ylidene)methyl)biphenyl-3-carboxylicAcid::CHEMBL1098322
SMILES COc1ccccc1C1C2=C(N=c3s\c(=C/c4ccc(cc4)-c4cccc(c4)C(O)=O)c(=O)n13)c1ccccc1CC2
InChI Key InChIKey=PDAWGEUNLGZMEW-FSGOGVSDSA-N
Data  1 IC50
  Tab Delimited (TSV)   2D SDfile   Computed 3D by Vconf -m prep SDfile
Find this compound or compounds like it in BindingDB:
Activity Spreadsheet -- Enzyme Inhibition Constant Data from BindingDB
Found 1 hit for monomerid = 50318199
TargetBcl-2-like protein 1(Homo sapiens (Human))
Chinese Academy Of Sciences
Curated by ChEMBL
LigandPNGBDBM50318199((Z)-30-((7-(2-Methoxyphenyl)-9-oxo-5H-benzo[h]thia...)
Affinity DataIC50:  2.67E+4nM. Assay description: Inhibition of human Bcl-XL
In DepthDetails ArticlePubMed