BDBM50318215 (Z)-3-(5-((7-(Furan-2-yl)-9-oxo-5H-benzo[h]thiazolo[2,3-b]quinazolin-10(6H,7H,9H)-ylidene)methyl)furan-2-yl)benzoic Acid::CHEMBL1095758
SMILES OC(=O)c1cccc(c1)-c1ccc(\C=c2/sc3=NC4=C(CCc5ccccc45)C(c4ccco4)n3c2=O)o1
InChI Key InChIKey=DDRCSJRNLROLKA-XYGWBWBKSA-N
Data  1 IC50
  Tab Delimited (TSV)   2D SDfile   Computed 3D by Vconf -m prep SDfile
Find this compound or compounds like it in BindingDB:
Activity Spreadsheet -- Enzyme Inhibition Constant Data from BindingDB
Found 1 hit for monomerid = 50318215
TargetBcl-2-like protein 1(Homo sapiens (Human))
Chinese Academy Of Sciences
Curated by ChEMBL
LigandPNGBDBM50318215((Z)-3-(5-((7-(Furan-2-yl)-9-oxo-5H-benzo[h]thiazol...)
Affinity DataIC50:  3.59E+4nM. Assay description: Inhibition of human Bcl-XL
In DepthDetails ArticlePubMed