BDBM50318220 6-((5S,9R)-9-(4-Cyanophenyl)-3-(3,5-dichlorophenyl)-1-methyl-2,4-dioxo-1,3,7-triazaspiro[4.4]nonan-7-yl)nicotinic Acid::6-[(5S,9R)-9-(4-cyanophenyl)-3-(3,5-dichlorophenyl)-1-methyl-2,4-dioxo-1,3,7-triazaspiro[4.4]non-7-yl]pyridine-3-carboxylic acid::CHEMBL1098726
SMILES CN1C(=O)N(C(=O)[C@]11CN(C[C@H]1c1ccc(cc1)C#N)c1ccc(cn1)C(O)=O)c1cc(Cl)cc(Cl)c1
InChI Key InChIKey=LILGMDXLRPEBNH-HFZDXXHNSA-N
Data  9 IC50
PDB links: 1 PDB ID matches this monomer.
  Tab Delimited (TSV)   2D SDfile   Computed 3D by Vconf -m prep SDfile
Find this compound or compounds like it in BindingDB:
Activity Spreadsheet -- Enzyme Inhibition Constant Data from BindingDB
Found 9 hits for monomerid = 50318220
TargetIntegrin alpha-L(Homo sapiens (Human))
Bristol-Myers Squibb Research And Development
Curated by ChEMBL
LigandPNGBDBM50318220(6-((5S,9R)-9-(4-Cyanophenyl)-3-(3,5-dichlorophenyl...)
Affinity DataIC50:  60nM. Assay description: Inhibition of LFA1-mediated human T cell proliferation assessed as [3H]thymidine uptake after 4 days by mixed lymphocyte reaction assay
TargetIntegrin alpha-L(Homo sapiens (Human))
Bristol-Myers Squibb Research And Development
Curated by ChEMBL
LigandPNGBDBM50318220(6-((5S,9R)-9-(4-Cyanophenyl)-3-(3,5-dichlorophenyl...)
Affinity DataIC50:  276nM. Assay description: Inhibition of LFA1-mediated IL2 mRNA level in SEB-stimulated human whole blood measured after 6 hrs post stimulation by RT-PCR analysis
TargetIntegrin alpha-L(Homo sapiens (Human))
Bristol-Myers Squibb Research And Development
Curated by ChEMBL
LigandPNGBDBM50318220(6-((5S,9R)-9-(4-Cyanophenyl)-3-(3,5-dichlorophenyl...)
Affinity DataIC50:  2.5nM. Assay description: Inhibition of LFA1-mediated adhesion of human T cells to ICAM1-expressing HUVEC by fluorescence assay
TargetIntegrin alpha-L(Mus musculus)
Bristol-Myers Squibb Research And Development
Curated by ChEMBL
LigandPNGBDBM50318220(6-((5S,9R)-9-(4-Cyanophenyl)-3-(3,5-dichlorophenyl...)
Affinity DataIC50:  150nM. Assay description: Inhibition of LFA1-mediated adhesion of C57BL/6 mouse T cells to ICAM1-expressing TNF-alpha-activated mouse b.END3 cells by calcein-AM staining-based...
In DepthDetails ArticlePubMed
TargetCytochrome P450 3A4(Homo sapiens (Human))
Bristol-Myers Squibb Research And Development
Curated by ChEMBL
LigandPNGBDBM50318220(6-((5S,9R)-9-(4-Cyanophenyl)-3-(3,5-dichlorophenyl...)
Affinity DataIC50: >3.50E+4nM. Assay description: Inhibition of CYP3A4
In DepthDetails ArticlePubMed
TargetCytochrome P450 2C9(Homo sapiens (Human))
Bristol-Myers Squibb Research And Development
Curated by ChEMBL
LigandPNGBDBM50318220(6-((5S,9R)-9-(4-Cyanophenyl)-3-(3,5-dichlorophenyl...)
Affinity DataIC50: >3.50E+4nM. Assay description: Inhibition of CYP2C9
In DepthDetails ArticlePubMed
TargetCytochrome P450 2D6(Homo sapiens (Human))
Bristol-Myers Squibb Research And Development
Curated by ChEMBL
LigandPNGBDBM50318220(6-((5S,9R)-9-(4-Cyanophenyl)-3-(3,5-dichlorophenyl...)
Affinity DataIC50: >3.50E+4nM. Assay description: Inhibition of CYP2D6
In DepthDetails ArticlePubMed
TargetCytochrome P450 2C19(Homo sapiens (Human))
Bristol-Myers Squibb Research And Development
Curated by ChEMBL
LigandPNGBDBM50318220(6-((5S,9R)-9-(4-Cyanophenyl)-3-(3,5-dichlorophenyl...)
Affinity DataIC50: >3.50E+4nM. Assay description: Inhibition of CYP2C19
In DepthDetails ArticlePubMed
TargetCytochrome P450 1A2(Homo sapiens (Human))
Bristol-Myers Squibb Research And Development
Curated by ChEMBL
LigandPNGBDBM50318220(6-((5S,9R)-9-(4-Cyanophenyl)-3-(3,5-dichlorophenyl...)
Affinity DataIC50: >3.50E+4nM. Assay description: Inhibition of CYP1A2
In DepthDetails ArticlePubMed