BDBM50318280 CHEMBL1098075::N-(2-phenethyl-6-phenyl-2H-pyrazolo[3,4-d]pyrimidin-4-yl)benzamide
SMILES O=C(Nc1nc(nc2nn(CCc3ccccc3)cc12)-c1ccccc1)c1ccccc1
InChI Key InChIKey=RYMBLKSWXYZCRJ-UHFFFAOYSA-N
Data  3 KI
  Tab Delimited (TSV)   2D SDfile   Computed 3D by Vconf -m prep SDfile
Find this compound or compounds like it in BindingDB:
Activity Spreadsheet -- Enzyme Inhibition Constant Data from BindingDB
Found 3 hits for monomerid = 50318280
TargetAdenosine receptor A1(Homo sapiens (Human))
Universit£
Curated by ChEMBL
LigandPNGBDBM50318280(CHEMBL1098075 | N-(2-phenethyl-6-phenyl-2H-pyrazol...)
Affinity DataKi:  27nM. Assay description: Displacement of [3H]DPCPX from human adenosine A1 receptor expressed in CHO cells
In DepthDetails ArticlePubMed
TargetAdenosine receptor A3(Homo sapiens (Human))
Universit£
Curated by ChEMBL
LigandPNGBDBM50318280(CHEMBL1098075 | N-(2-phenethyl-6-phenyl-2H-pyrazol...)
Affinity DataKi:  43.7nM. Assay description: Displacement of [125I]AB-MECA from human adenosine A3 receptor expressed in CHO cells
In DepthDetails ArticlePubMed
TargetAdenosine receptor A2a(Homo sapiens (Human))
Universit£
Curated by ChEMBL
LigandPNGBDBM50318280(CHEMBL1098075 | N-(2-phenethyl-6-phenyl-2H-pyrazol...)
Affinity DataKi:  227nM. Assay description: Displacement of [3H]NECA from human adenosine A2A receptor expressed in CHO cells
In DepthDetails ArticlePubMed