BDBM50318316 5-hexyl-3-m-tolyloxazolidin-2-one::CHEMBL1096423
SMILES CCCCCCC1CN(C(=O)O1)c1cccc(C)c1
InChI Key InChIKey=VIJUWKIVYPEVLF-UHFFFAOYSA-N
Data  1 EC50
  Tab Delimited (TSV)   2D SDfile   Computed 3D by Vconf -m prep SDfile
Find this compound or compounds like it in BindingDB:
Activity Spreadsheet -- Enzyme Inhibition Constant Data from BindingDB
Found 1 hit for monomerid = 50318316
TargetMetabotropic glutamate receptor 2(Homo sapiens (Human))
Merck Research Laboratories
Curated by ChEMBL
LigandPNGBDBM50318316(5-hexyl-3-m-tolyloxazolidin-2-one | CHEMBL1096423)
Affinity DataEC50:  640nM. Assay description: Allosteric modulation of human mGluR2 expressed in CHO dhfr cells co-expressing G-protein Galpha16 assessed as potentiation of glutamate-induced calc...
In DepthDetails ArticlePubMed