BDBM50318321 3-(2-chlorophenyl)-5-hexyloxazolidin-2-one::CHEMBL1097051
SMILES CCCCCCC1CN(C(=O)O1)c1ccccc1Cl
InChI Key InChIKey=GIFNYHYWVPJWTC-UHFFFAOYSA-N
Data  1 EC50
  Tab Delimited (TSV)   2D SDfile   Computed 3D by Vconf -m prep SDfile
Find this compound or compounds like it in BindingDB:
Activity Spreadsheet -- Enzyme Inhibition Constant Data from BindingDB
Found 1 hit for monomerid = 50318321
TargetMetabotropic glutamate receptor 2(Homo sapiens (Human))
Merck Research Laboratories
Curated by ChEMBL
LigandPNGBDBM50318321(3-(2-chlorophenyl)-5-hexyloxazolidin-2-one | CHEMB...)
Affinity DataEC50: >3.00E+4nM. Assay description: Allosteric modulation of human mGluR2 expressed in CHO dhfr cells co-expressing G-protein Galpha16 assessed as potentiation of glutamate-induced calc...
In DepthDetails ArticlePubMed