BDBM50318342 5-octyl-3-phenyloxazolidin-2-one::CHEMBL1095701
SMILES CCCCCCCCC1CN(C(=O)O1)c1ccccc1
InChI Key InChIKey=DRQVAMDRLMKALN-UHFFFAOYSA-N
Data  1 EC50
  Tab Delimited (TSV)   2D SDfile   Computed 3D by Vconf -m prep SDfile
Find this compound or compounds like it in BindingDB:
Activity Spreadsheet -- Enzyme Inhibition Constant Data from BindingDB
Found 1 hit for monomerid = 50318342
TargetMetabotropic glutamate receptor 2(Homo sapiens (Human))
Merck Research Laboratories
Curated by ChEMBL
LigandPNGBDBM50318342(5-octyl-3-phenyloxazolidin-2-one | CHEMBL1095701)
Affinity DataEC50:  1.20E+3nM. Assay description: Allosteric modulation of human mGluR2 expressed in CHO dhfr cells co-expressing G-protein Galpha16 assessed as potentiation of glutamate-induced calc...
In DepthDetails ArticlePubMed