BDBM50318354 5-((2-isopropylphenoxy)methyl)-3-phenyloxazolidin-2-one::CHEMBL1097379
SMILES CC(C)c1ccccc1OCC1CN(C(=O)O1)c1ccccc1
InChI Key InChIKey=BXAKGDOWQZLGRA-UHFFFAOYSA-N
Data  1 EC50
  Tab Delimited (TSV)   2D SDfile   Computed 3D by Vconf -m prep SDfile
Find this compound or compounds like it in BindingDB:
Activity Spreadsheet -- Enzyme Inhibition Constant Data from BindingDB
Found 1 hit for monomerid = 50318354
TargetMetabotropic glutamate receptor 2(Homo sapiens (Human))
Merck Research Laboratories
Curated by ChEMBL
LigandPNGBDBM50318354(5-((2-isopropylphenoxy)methyl)-3-phenyloxazolidin-...)
Affinity DataEC50: >3.00E+4nM. Assay description: Allosteric modulation of human mGluR2 expressed in CHO dhfr cells co-expressing G-protein Galpha16 assessed as potentiation of glutamate-induced calc...
In DepthDetails ArticlePubMed