BDBM50318356 5-((4-isopropylphenoxy)methyl)-3-phenyloxazolidin-2-one::CHEMBL1096711
SMILES CC(C)c1ccc(OCC2CN(C(=O)O2)c2ccccc2)cc1
InChI Key InChIKey=RANFDSQQLNBMJN-UHFFFAOYSA-N
Data  1 EC50
  Tab Delimited (TSV)   2D SDfile   Computed 3D by Vconf -m prep SDfile
Find this compound or compounds like it in BindingDB:
Activity Spreadsheet -- Enzyme Inhibition Constant Data from BindingDB
Found 1 hit for monomerid = 50318356
TargetMetabotropic glutamate receptor 2(Homo sapiens (Human))
Merck Research Laboratories
Curated by ChEMBL
LigandPNGBDBM50318356(5-((4-isopropylphenoxy)methyl)-3-phenyloxazolidin-...)
Affinity DataEC50:  360nM. Assay description: Allosteric modulation of human mGluR2 expressed in CHO dhfr cells co-expressing G-protein Galpha16 assessed as potentiation of glutamate-induced calc...
In DepthDetails ArticlePubMed