BDBM50318590 4-(4-(6-Bromo-7-(4-(pyrimidin-5-ylmethyl)piperazin-1-yl)-3H-imidazo[4,5-b]pyridin-2-yl)benzyl)morpholine::CHEMBL1084860
SMILES Brc1cnc2nc([nH]c2c1N1CCN(Cc2cncnc2)CC1)-c1ccc(CN2CCOCC2)cc1
InChI Key InChIKey=GHFLJXVPVDOMRW-UHFFFAOYSA-N
Data  2 IC50
  Tab Delimited (TSV)   2D SDfile   Computed 3D by Vconf -m prep SDfile
Find this compound or compounds like it in BindingDB:
Activity Spreadsheet -- Enzyme Inhibition Constant Data from BindingDB
Found 2 hits for monomerid = 50318590
TargetAurora kinase A(Homo sapiens (Human))
The Institute Of Cancer Research
Curated by ChEMBL
LigandPNGBDBM50318590(4-(4-(6-Bromo-7-(4-(pyrimidin-5-ylmethyl)piperazin...)
Affinity DataIC50:  6nM. Assay description: Inhibition of human recombinant Aurora A expressed in baculovirus system
In DepthDetails ArticlePubMed
TargetAurora kinase A(Homo sapiens (Human))
The Institute Of Cancer Research
Curated by ChEMBL
LigandPNGBDBM50318590(4-(4-(6-Bromo-7-(4-(pyrimidin-5-ylmethyl)piperazin...)
Affinity DataIC50:  6nM. Assay description: Inhibition of Aurora A
In DepthDetails ArticlePubMed