BDBM50318607 2-(4-(6-Bromo-7-(4-((5-methylisoxazol-3-yl)methyl)piperazin-1-yl)-3Himidazo[4,5-b]pyridin-2-yl)phenoxy)ethanol::CHEMBL1085132
SMILES Cc1cc(CN2CCN(CC2)c2c(Br)cnc3nc([nH]c23)-c2ccc(OCCO)cc2)no1
InChI Key InChIKey=ALEYRQPFVFNLMN-UHFFFAOYSA-N
Data  2 IC50
  Tab Delimited (TSV)   2D SDfile   Computed 3D by Vconf -m prep SDfile
Find this compound or compounds like it in BindingDB:
Activity Spreadsheet -- Enzyme Inhibition Constant Data from BindingDB
Found 2 hits for monomerid = 50318607
TargetAurora kinase A(Homo sapiens (Human))
The Institute Of Cancer Research
Curated by ChEMBL
LigandPNGBDBM50318607(2-(4-(6-Bromo-7-(4-((5-methylisoxazol-3-yl)methyl)...)
Affinity DataIC50:  30nM. Assay description: Inhibition of human recombinant Aurora A expressed in baculovirus system
In DepthDetails ArticlePubMed
TargetAurora kinase A(Homo sapiens (Human))
The Institute Of Cancer Research
Curated by ChEMBL
LigandPNGBDBM50318607(2-(4-(6-Bromo-7-(4-((5-methylisoxazol-3-yl)methyl)...)
Affinity DataIC50:  30nM. Assay description: Inhibition of Aurora A
In DepthDetails ArticlePubMed