BDBM50318933 4-(2,4-dicyclopropyl-1-(methylsulfonylmethyl)-1H-pyrrol-3-yloxy)benzonitrile::CHEMBL1083755
SMILES CS(=O)(=O)Cn1cc(C2CC2)c(Oc2ccc(cc2)C#N)c1C1CC1
InChI Key InChIKey=WWMIJCSLGKHEGX-UHFFFAOYSA-N
Data  1 IC50
  Tab Delimited (TSV)   2D SDfile   Computed 3D by Vconf -m prep SDfile
Find this compound or compounds like it in BindingDB:
Activity Spreadsheet -- Enzyme Inhibition Constant Data from BindingDB
Found 1 hit for monomerid = 50318933
TargetProgesterone receptor(Homo sapiens (Human))
Pfizer
Curated by ChEMBL
LigandPNGBDBM50318933(4-(2,4-dicyclopropyl-1-(methylsulfonylmethyl)-1H-p...)
Affinity DataIC50:  71nM. Assay description: Antagonist activity at human recombinant progesterone receptor expressed in CHO-MMTV-beta-lactamase cells assessed as inhibition of progesterone-indu...
In DepthDetails ArticlePubMed