BDBM50318944 4-(2,4-diethyl-1H-pyrrol-3-yloxy)benzonitrile::CHEMBL1084705
SMILES CCc1c[nH]c(CC)c1Oc1ccc(cc1)C#N
InChI Key InChIKey=XXYHXMUPGLKKGE-UHFFFAOYSA-N
Data  1 IC50
  Tab Delimited (TSV)   2D SDfile   Computed 3D by Vconf -m prep SDfile
Find this compound or compounds like it in BindingDB:
Activity Spreadsheet -- Enzyme Inhibition Constant Data from BindingDB
Found 1 hit for monomerid = 50318944
TargetProgesterone receptor(Homo sapiens (Human))
Pfizer
Curated by ChEMBL
LigandPNGBDBM50318944(4-(2,4-diethyl-1H-pyrrol-3-yloxy)benzonitrile | CH...)
Affinity DataIC50:  224nM. Assay description: Antagonist activity at human recombinant progesterone receptor expressed in CHO-MMTV-beta-lactamase cells assessed as inhibition of progesterone-indu...
In DepthDetails ArticlePubMed