BDBM50319164 4-Difluoromethyl-8-methoxy-3-methyl-1-propyl-imidazo[1,5-a]pyrido[3,2-e]pyrazine::CHEMBL1084713
SMILES CCCc1nc(C)c2c(nc3ccc(OC)nc3n12)C(F)F
InChI Key InChIKey=KIPWWZHQMRMPFX-UHFFFAOYSA-N
Data  1 IC50
  Tab Delimited (TSV)   2D SDfile   Computed 3D by Vconf -m prep SDfile
Find this compound or compounds like it in BindingDB:
Activity Spreadsheet -- Enzyme Inhibition Constant Data from BindingDB
Found 1 hit for monomerid = 50319164
TargetcAMP and cAMP-inhibited cGMP 3',5'-cyclic phosphodiesterase 10A(Homo sapiens (Human))
Biotie Therapies
Curated by ChEMBL
LigandPNGBDBM50319164(4-Difluoromethyl-8-methoxy-3-methyl-1-propyl-imida...)
Affinity DataIC50:  7.30nM. Assay description: Inhibition of human recombinant PDE10A expressed in baculovirus-SF21 cell system assessed as hydrolysis of [3H]cAMP after 1 hr by liquid scintillatio...
In DepthDetails ArticlePubMed