BDBM50319193 4-Acetylamino-8-Methoxy-3-methyl-1-propyl-imidazo[1,5-a]-pyrido[3,2-e]pyrazine::CHEMBL1083715
SMILES CCCc1nc(C)c2c(NC(C)=O)nc3ccc(OC)nc3n12
InChI Key InChIKey=ZZFTYHKMONNQIW-UHFFFAOYSA-N
Data  1 IC50
  Tab Delimited (TSV)   2D SDfile   Computed 3D by Vconf -m prep SDfile
Find this compound or compounds like it in BindingDB:
Activity Spreadsheet -- Enzyme Inhibition Constant Data from BindingDB
Found 1 hit for monomerid = 50319193
TargetcAMP and cAMP-inhibited cGMP 3',5'-cyclic phosphodiesterase 10A(Homo sapiens (Human))
Biotie Therapies
Curated by ChEMBL
LigandPNGBDBM50319193(4-Acetylamino-8-Methoxy-3-methyl-1-propyl-imidazo[...)
Affinity DataIC50:  472nM. Assay description: Inhibition of human recombinant PDE10A expressed in baculovirus-SF21 cell system assessed as hydrolysis of [3H]cAMP after 1 hr by liquid scintillatio...
In DepthDetails ArticlePubMed