BDBM50319280 1-(3-(4-(5-fluoro-4-methyl-1H-benzo[d]imidazol-2-yl)-3-methylphenoxy)propyl)-N,N-dimethylpyrrolidin-3-amine::CHEMBL1083084
SMILES CN(C)C1CCN(CCCOc2ccc(-c3nc4ccc(F)c(C)c4[nH]3)c(C)c2)C1
InChI Key InChIKey=OWQWPXCWDHUFEH-UHFFFAOYSA-N
Data  1 KI  1 EC50
  Tab Delimited (TSV)   2D SDfile   Computed 3D by Vconf -m prep SDfile
Find this compound or compounds like it in BindingDB:
Activity Spreadsheet -- Enzyme Inhibition Constant Data from BindingDB
Found 2 hits for monomerid = 50319280
TargetHistamine H4 receptor(Homo sapiens (Human))
Johnson & Johnson Pharmaceutical Research & Development
Curated by ChEMBL
LigandPNGBDBM50319280(1-(3-(4-(5-fluoro-4-methyl-1H-benzo[d]imidazol-2-y...)
Affinity DataKi:  84nM. Assay description: Displacement of [3H]histamine from human recombinant histamine H4 receptor
In DepthDetails ArticlePubMed
TargetHistamine H4 receptor(Homo sapiens (Human))
Johnson & Johnson Pharmaceutical Research & Development
Curated by ChEMBL
LigandPNGBDBM50319280(1-(3-(4-(5-fluoro-4-methyl-1H-benzo[d]imidazol-2-y...)
Affinity DataEC50:  150nM. Assay description: Agonist activity at human histamine H4 receptor in SK-N-MC cells assessed as forskolin-stimulated cAMP release preincubated for 10 mins before forsko...
In DepthDetails ArticlePubMed