BDBM50319321 1-(3,4-dimethoxyphenyl)-2-(1-isopropyl-1H-tetrazol-5-ylthio)ethanone::CHEMBL1085143
SMILES COc1ccc(cc1OC)C(=O)CSc1cnnn1C(C)C
InChI Key InChIKey=UZSYARXNPQAGEI-UHFFFAOYSA-N
Data  1 IC50
  Tab Delimited (TSV)   2D SDfile   Computed 3D by Vconf -m prep SDfile
Find this compound or compounds like it in BindingDB:
Activity Spreadsheet -- Enzyme Inhibition Constant Data from BindingDB
Found 1 hit for monomerid = 50319321
Target11-beta-hydroxysteroid dehydrogenase 1(Homo sapiens (Human))
University Of Edinburgh
Curated by ChEMBL
LigandPNGBDBM50319321(1-(3,4-dimethoxyphenyl)-2-(1-isopropyl-1H-tetrazol...)
Affinity DataIC50:  954nM. Assay description: Inhibition of human 11beta-HSD1 expressed in HEK293 cells by scintillation proximity assay
In DepthDetails ArticlePubMed