BDBM50319435 (R)-3-(1'-(4,6-dimethylpyrimidine-5-carbonyl)-4'-methyl-1,4'-bipiperidin-4-yl)-1-((trans-4-methoxycyclohexyl)methyl)-4-phenylimidazolidin-2-one::CHEMBL1085222
SMILES CO[C@H]1CC[C@H](CN2C[C@H](N(C3CCN(CC3)C3(C)CCN(CC3)C(=O)c3c(C)ncnc3C)C2=O)c2ccccc2)CC1
InChI Key InChIKey=NJZLCVZALWTNEZ-NAYUSWPISA-N
Data  1 IC50
  Tab Delimited (TSV)   2D SDfile   Computed 3D by Vconf -m prep SDfile
Find this compound or compounds like it in BindingDB:
Activity Spreadsheet -- Enzyme Inhibition Constant Data from BindingDB
Found 1 hit for monomerid = 50319435
TargetC-C chemokine receptor type 5(Homo sapiens (Human))
Roche Palo Alto
Curated by ChEMBL
LigandPNGBDBM50319435((R)-3-(1'-(4,6-dimethylpyrimidine-5-carbonyl)-4'-m...)
Affinity DataIC50:  62nM. Assay description: Binding affinity at CCR5 receptor by radiolabelled RANTES binding assay
In DepthDetails ArticlePubMed