BDBM50319447 (R)-4,6-dimethyl-5-(4'-methyl-4-(2-oxo-5-phenyl-3-((tetrahydro-2H-pyran-4-yl)methyl)imidazolidin-1-yl)-1,4'-bipiperidine-1'-carbonyl)picolinonitrile::CHEMBL1085225
SMILES Cc1cc(nc(C)c1C(=O)N1CCC(C)(CC1)N1CCC(CC1)N1[C@@H](CN(CC2CCOCC2)C1=O)c1ccccc1)C#N
InChI Key InChIKey=VCDAYNSEVSLHGF-HKBQPEDESA-N
Data  1 IC50
  Tab Delimited (TSV)   2D SDfile   Computed 3D by Vconf -m prep SDfile
Find this compound or compounds like it in BindingDB:
Activity Spreadsheet -- Enzyme Inhibition Constant Data from BindingDB
Found 1 hit for monomerid = 50319447
TargetC-C chemokine receptor type 5(Homo sapiens (Human))
Roche Palo Alto
Curated by ChEMBL
LigandPNGBDBM50319447((R)-4,6-dimethyl-5-(4'-methyl-4-(2-oxo-5-phenyl-3-...)
Affinity DataIC50:  12nM. Assay description: Binding affinity at CCR5 receptor by radiolabelled RANTES binding assay
In DepthDetails ArticlePubMed