BDBM50319463 1-(1H-indazol-4-yl)-3-((2-(3-methoxypropyl)-6-(trifluoromethyl)pyridin-3-yl)methyl)urea::CHEMBL1086019
SMILES COCCCc1nc(ccc1CNC(=O)Nc1cccc2[nH]ncc12)C(F)(F)F
InChI Key InChIKey=GRZBWGYGOQGCSD-UHFFFAOYSA-N
Data  1 IC50
  Tab Delimited (TSV)   2D SDfile   Computed 3D by Vconf -m prep SDfile
Find this compound or compounds like it in BindingDB:
Activity Spreadsheet -- Enzyme Inhibition Constant Data from BindingDB
Found 1 hit for monomerid = 50319463
TargetTransient receptor potential cation channel subfamily V member 1(Homo sapiens (Human))
Abbott Laboratories
Curated by ChEMBL
LigandPNGBDBM50319463(1-(1H-indazol-4-yl)-3-((2-(3-methoxypropyl)-6-(tri...)
Affinity DataIC50:  12nM. Assay description: Antagonist activity at human TRPV1
In DepthDetails ArticlePubMed