BDBM50319501 (R)-4-(6-(2-(2-methylpyrrolidin-1-yl)ethyl)quinolin-2-yl)benzonitrile::CHEMBL1085800
SMILES C[C@@H]1CCCN1CCc1ccc2nc(ccc2c1)-c1ccc(cc1)C#N
InChI Key InChIKey=LQLTVDHLUGEPRE-QGZVFWFLSA-N
Data  4 KI  1 IC50
  Tab Delimited (TSV)   2D SDfile   Computed 3D by Vconf -m prep SDfile
Find this compound or compounds like it in BindingDB:
Activity Spreadsheet -- Enzyme Inhibition Constant Data from BindingDB
Found 5 hits for monomerid = 50319501
TargetHistamine H3 receptor(Homo sapiens (Human))
Abbott Laboratories
Curated by ChEMBL
LigandPNGBDBM50319501((R)-4-(6-(2-(2-methylpyrrolidin-1-yl)ethyl)quinoli...)
Affinity DataKi:  0.690nM. Assay description: Displacement of [3H]-N-alpha-methylhistamine from human cloned histamine H3 receptor
In DepthDetails ArticlePubMed
TargetHistamine H3 receptor(Homo sapiens (Human))
Abbott Laboratories
Curated by ChEMBL
LigandPNGBDBM50319501((R)-4-(6-(2-(2-methylpyrrolidin-1-yl)ethyl)quinoli...)
Affinity DataKi:  0.700nM. Assay description: Displacement of [125I]Iodoproxyfan from human recombinant histamine H3 receptor by Competitive binding assay
In DepthDetails ArticlePubMed
TargetHistamine H3 receptor(Rattus norvegicus (rat))
Abbott Laboratories
Curated by ChEMBL
LigandPNGBDBM50319501((R)-4-(6-(2-(2-methylpyrrolidin-1-yl)ethyl)quinoli...)
Affinity DataKi:  3.90nM. Assay description: Displacement of [3H]-N-alpha-methylhistamine from rat cloned histamine H3 receptor
In DepthDetails ArticlePubMed
TargetPotassium voltage-gated channel subfamily H member 2(Homo sapiens (Human))
Abbott Laboratories
Curated by ChEMBL
LigandPNGBDBM50319501((R)-4-(6-(2-(2-methylpyrrolidin-1-yl)ethyl)quinoli...)
Affinity DataKi:  780nM. Assay description: Displacement of [3H]dofetilide from human ERG expressed in HEK293 cells
In DepthDetails ArticlePubMed
TargetPotassium voltage-gated channel subfamily H member 2(Homo sapiens (Human))
Abbott Laboratories
Curated by ChEMBL
LigandPNGBDBM50319501((R)-4-(6-(2-(2-methylpyrrolidin-1-yl)ethyl)quinoli...)
Affinity DataIC50:  3.20E+3nM. Assay description: Displacement of [3H]dofetilide from human recombinant ERG by Competitive binding assay
In DepthDetails ArticlePubMed