BDBM50319545 2-(1-(2,4-difluorophenyl)-5-methyl-1H-1,2,3-triazol-4-yl)-6-(2-((R)-2-methylpyrrolidin-1-yl)ethyl)quinoline::CHEMBL1086098
SMILES C[C@@H]1CCCN1CCc1ccc2nc(ccc2c1)-c1nnn(c1C)-c1ccc(F)cc1F
InChI Key InChIKey=UBKCIYMLUUFSDB-MRXNPFEDSA-N
Data  4 KI  1 IC50
  Tab Delimited (TSV)   2D SDfile   Computed 3D by Vconf -m prep SDfile
Find this compound or compounds like it in BindingDB:
Activity Spreadsheet -- Enzyme Inhibition Constant Data from BindingDB
Found 5 hits for monomerid = 50319545
TargetHistamine H3 receptor(Homo sapiens (Human))
Abbott Laboratories
Curated by ChEMBL
LigandPNGBDBM50319545(2-(1-(2,4-difluorophenyl)-5-methyl-1H-1,2,3-triazo...)
Affinity DataKi:  0.290nM. Assay description: Displacement of [3H]-N-alpha-methylhistamine from human cloned histamine H3 receptor
In DepthDetails ArticlePubMed
TargetHistamine H3 receptor(Homo sapiens (Human))
Abbott Laboratories
Curated by ChEMBL
LigandPNGBDBM50319545(2-(1-(2,4-difluorophenyl)-5-methyl-1H-1,2,3-triazo...)
Affinity DataKi:  0.290nM. Assay description: Displacement of [125I]Iodoproxyfan from human recombinant histamine H3 receptor by Competitive binding assay
In DepthDetails ArticlePubMed
TargetHistamine H3 receptor(Rattus norvegicus (rat))
Abbott Laboratories
Curated by ChEMBL
LigandPNGBDBM50319545(2-(1-(2,4-difluorophenyl)-5-methyl-1H-1,2,3-triazo...)
Affinity DataKi:  0.350nM. Assay description: Displacement of [3H]-N-alpha-methylhistamine from rat cloned histamine H3 receptor
In DepthDetails ArticlePubMed
TargetPotassium voltage-gated channel subfamily H member 2(Homo sapiens (Human))
Abbott Laboratories
Curated by ChEMBL
LigandPNGBDBM50319545(2-(1-(2,4-difluorophenyl)-5-methyl-1H-1,2,3-triazo...)
Affinity DataKi:  720nM. Assay description: Displacement of [3H]dofetilide from human ERG expressed in HEK293 cells
In DepthDetails ArticlePubMed
TargetPotassium voltage-gated channel subfamily H member 2(Homo sapiens (Human))
Abbott Laboratories
Curated by ChEMBL
LigandPNGBDBM50319545(2-(1-(2,4-difluorophenyl)-5-methyl-1H-1,2,3-triazo...)
Affinity DataIC50:  2.80E+3nM. Assay description: Displacement of [3H]dofetilide from human recombinant ERG by Competitive binding assay
In DepthDetails ArticlePubMed