BDBM50319781 (2-chloro-5-methoxy-2'-methylbiphenyl-4-yl)((1R,5S)-1,3,3-trimethyl-6-azabicyclo[3.2.1]octan-6-yl)methanone::CHEMBL1083730
SMILES COc1cc(c(Cl)cc1C(=O)N1C[C@@]2(C)C[C@@H]1CC(C)(C)C2)-c1ccccc1C
InChI Key InChIKey=UJXPNHJXBUDOGG-GKVSMKOHSA-N
Data  2 KI
  Tab Delimited (TSV)   2D SDfile   Computed 3D by Vconf -m prep SDfile
Find this compound or compounds like it in BindingDB:
Activity Spreadsheet -- Enzyme Inhibition Constant Data from BindingDB
Found 2 hits for monomerid = 50319781
TargetVasopressin V1a receptor(Homo sapiens (Human))
Pfizer
Curated by ChEMBL
LigandPNGBDBM50319781((2-chloro-5-methoxy-2'-methylbiphenyl-4-yl)((1R,5S...)
Affinity DataKi:  25nM. Assay description: Displacement [3H]Arg human recombinant Vasopressin V1a receptor
In DepthDetails ArticlePubMed
TargetVasopressin V2 receptor(Homo sapiens (Human))
Pfizer
Curated by ChEMBL
LigandPNGBDBM50319781((2-chloro-5-methoxy-2'-methylbiphenyl-4-yl)((1R,5S...)
Affinity DataKi:  1.21E+3nM. Assay description: Displacement [3H]Arg human recombinant Vasopressin V2 receptor
In DepthDetails ArticlePubMed