BDBM50319846 (S)-4-(1-(1-(3-chlorobenzyl)-2-methyl-1H-indole-7-carboxamido)ethyl)benzoic acid::CHEMBL1084047
SMILES C[C@H](NC(=O)c1cccc2cc(C)n(Cc3cccc(Cl)c3)c12)c1ccc(cc1)C(O)=O
InChI Key InChIKey=BQDKQRRXORHZRW-KRWDZBQOSA-N
Data  2 KI
  Tab Delimited (TSV)   2D SDfile   Computed 3D by Vconf -m prep SDfile
Find this compound or compounds like it in BindingDB:
Activity Spreadsheet -- Enzyme Inhibition Constant Data from BindingDB
Found 2 hits for monomerid = 50319846
TargetProstaglandin E2 receptor EP4 subtype(Homo sapiens (Human))
Merck Frosst Canada
Curated by ChEMBL
LigandPNGBDBM50319846((S)-4-(1-(1-(3-chlorobenzyl)-2-methyl-1H-indole-7-...)
Affinity DataKi:  56nM. Assay description: Displacement of [3H]PGE2 from human prostanoid EP4 receptor expressed in HEK293-EBNA cells after 60 mins by scintillation counting
In DepthDetails ArticlePubMed
TargetProstaglandin D2 receptor(Homo sapiens (Human))
Merck Frosst Canada
Curated by ChEMBL
LigandPNGBDBM50319846((S)-4-(1-(1-(3-chlorobenzyl)-2-methyl-1H-indole-7-...)
Affinity DataKi:  450nM. Assay description: Displacement of [3H]PGD2 from human Prostanoid DP1 receptor expressed in HEK293-EBNA cells after 60 mins by scintillation counting
In DepthDetails ArticlePubMed