BDBM50319872 CHEMBL1083720::N-((2-chloro-1-mesityl-6-(trifluoromethyl)-1H-imidazo[1,2-a]imidazol-5-yl)methyl)-N-(2-methylbenzyl)ethanamine
SMILES CCN(Cc1c(nc2n(c(Cl)cn12)-c1c(C)cc(C)cc1C)C(F)(F)F)Cc1ccccc1C
InChI Key InChIKey=LGKZWFDKBAROEW-UHFFFAOYSA-N
Data  1 KI
  Tab Delimited (TSV)   2D SDfile   Computed 3D by Vconf -m prep SDfile
Find this compound or compounds like it in BindingDB:
Activity Spreadsheet -- Enzyme Inhibition Constant Data from BindingDB
Found 1 hit for monomerid = 50319872
TargetCorticotropin-releasing factor receptor 1(Homo sapiens (Human))
Bristol-Myers Squibb Pharmaceutical Research Institute
Curated by ChEMBL
LigandPNGBDBM50319872(CHEMBL1083720 | N-((2-chloro-1-mesityl-6-(trifluor...)
Affinity DataKi:  4.80E+3nM. Assay description: Displacement of [125I] Tyr-o-CRF from human CRF[125I]receptor expressed in human IMR-3[125I]cells after 100 mins
In DepthDetails ArticlePubMed