BDBM50319904 CHEMBL1083320::N-((2-chloro-1-mesityl-6-(trifluoromethyl)-1H-imidazo[1,2-a]imidazol-5-yl)methyl)-N-(cyclopropylmethyl)-3,3,3-trifluoropropan-1-amine
SMILES Cc1cc(C)c(c(C)c1)-n1c(Cl)cn2c(CN(CCC(F)(F)F)CC3CC3)c(nc12)C(F)(F)F
InChI Key InChIKey=BAXPFBZZMCCNTO-UHFFFAOYSA-N
Data  1 KI
  Tab Delimited (TSV)   2D SDfile   Computed 3D by Vconf -m prep SDfile
Find this compound or compounds like it in BindingDB:
Activity Spreadsheet -- Enzyme Inhibition Constant Data from BindingDB
Found 1 hit for monomerid = 50319904
TargetCorticotropin-releasing factor receptor 1(Homo sapiens (Human))
Bristol-Myers Squibb Pharmaceutical Research Institute
Curated by ChEMBL
LigandPNGBDBM50319904(CHEMBL1083320 | N-((2-chloro-1-mesityl-6-(trifluor...)
Affinity DataKi:  16nM. Assay description: Displacement of [125I] Tyr-o-CRF from human CRF[125I]receptor expressed in human IMR-3[125I]cells after 100 mins
In DepthDetails ArticlePubMed