BDBM50319913 6-(dibenzo[b,d]furan-4-yl)-4-morpholino-2H-chromen-2-one::CHEMBL1083004
SMILES O=c1cc(N2CCOCC2)c2cc(ccc2o1)-c1cccc2c1oc1ccccc21
InChI Key InChIKey=DBQPFLZLSHVFCL-UHFFFAOYSA-N
Data  1 IC50
  Tab Delimited (TSV)   2D SDfile   Computed 3D by Vconf -m prep SDfile
Find this compound or compounds like it in BindingDB:
Activity Spreadsheet -- Enzyme Inhibition Constant Data from BindingDB
Found 1 hit for monomerid = 50319913
TargetDNA-dependent protein kinase catalytic subunit(Homo sapiens (Human))
Newcastle University
Curated by ChEMBL
LigandPNGBDBM50319913(6-(dibenzo[b,d]furan-4-yl)-4-morpholino-2H-chromen...)
Affinity DataIC50: >1.00E+4nM. Assay description: Inhibition of DNA-dependent protein kinase
In DepthDetails ArticlePubMed