BDBM50319984 4-(pyrimidin-2-yloxy)-N-(2-(trifluoromethoxy)benzyl)piperidine-1-carboxamide::CHEMBL1082684
SMILES FC(F)(F)Oc1ccccc1CNC(=O)N1CCC(CC1)Oc1ncccn1
InChI Key InChIKey=PMWQIIOHOWIEAH-UHFFFAOYSA-N
Data  4 IC50
  Tab Delimited (TSV)   2D SDfile   Computed 3D by Vconf -m prep SDfile
Find this compound or compounds like it in BindingDB:
Activity Spreadsheet -- Enzyme Inhibition Constant Data from BindingDB
Found 4 hits for monomerid = 50319984
TargetBifunctional epoxide hydrolase 2(Homo sapiens (Human))
Boehringer Ingelheim Pharmaceuticals
Curated by ChEMBL
LigandPNGBDBM50319984(4-(pyrimidin-2-yloxy)-N-(2-(trifluoromethoxy)benzy...)
Affinity DataIC50:  40nM. Assay description: Inhibition of human soluble epoxide hydrolase assessed as [2-3H]-trans-1,3-diphenyl propylene oxide hydrolysis by cellular assay
In DepthDetails ArticlePubMed
TargetCytochrome P450 2C9(Homo sapiens (Human))
Boehringer Ingelheim Pharmaceuticals
Curated by ChEMBL
LigandPNGBDBM50319984(4-(pyrimidin-2-yloxy)-N-(2-(trifluoromethoxy)benzy...)
Affinity DataIC50:  1.02E+4nM. Assay description: Inhibition of CYP2C9
In DepthDetails ArticlePubMed
TargetCytochrome P450 2J2(Homo sapiens (Human))
Boehringer Ingelheim Pharmaceuticals
Curated by ChEMBL
LigandPNGBDBM50319984(4-(pyrimidin-2-yloxy)-N-(2-(trifluoromethoxy)benzy...)
Affinity DataIC50:  2.00E+3nM. Assay description: Inhibition of CYP2J2
In DepthDetails ArticlePubMed
TargetBifunctional epoxide hydrolase 2(Homo sapiens (Human))
Boehringer Ingelheim Pharmaceuticals
Curated by ChEMBL
LigandPNGBDBM50319984(4-(pyrimidin-2-yloxy)-N-(2-(trifluoromethoxy)benzy...)
Affinity DataIC50:  4nM. Assay description: Inhibition of human soluble epoxide hydrolase
In DepthDetails ArticlePubMed